Nao consigo corrigir esse erro


#1

COMPILER ERROR:

/workspace/platforms/android/gradlew: Command failed with exit code 1 Error output:
FAILURE: Build failed with an exception.

  • What went wrong:
    A problem occurred configuring root project ‘android’.

Could not resolve all dependencies for configuration ‘:_armv7DebugApkCopy’.
Could not find com.google.android.gms:play-services-ads:15.0.1.
Searched in the following locations:
file:/opt/cocoon_compiler/workspace/production/data/sdks/android-sdks-linux/extras/google/m2repository/com/google/android/gms/play-services-ads/15.0.1/play-services-ads-15.0.1.pom
file:/opt/cocoon_compiler/workspace/production/data/sdks/android-sdks-linux/extras/google/m2repository/com/google/android/gms/play-services-ads/15.0.1/play-services-ads-15.0.1.jar
file:/workspace/platforms/android/sdk-manager/com/google/android/gms/play-services-ads/15.0.1/play-services-ads-15.0.1.jar
file:/opt/cocoon_compiler/workspace/production/data/sdks/android-sdks-linux/extras/android/m2repository/com/google/android/gms/play-services-ads/15.0.1/play-services-ads-15.0.1.pom
file:/opt/cocoon_compiler/workspace/production/data/sdks/android-sdks-linux/extras/android/m2repository/com/google/android/gms/play-services-ads/15.0.1/play-services-ads-15.0.1.jar
file:/workspace/platforms/android/sdk-manager/com/google/android/gms/play-services-ads/15.0.1/play-services-ads-15.0.1.jar
Required by:
project :

  • Try:
    Run with --stacktrace option to get the stack trace. Run with --info or --debug option to get more log output.

CORDOVA LOG:

e[36m20181026T160738 [DEBUG] AndroidBuilder -e[39m [prepare] cordova restore platforms
e[36m20181026T160738 [DEBUG] AndroidBuilder -e[39m [prepare] adding engine android@6.2.3
Subproject Path: CordovaLib
Subproject Path: CordovaLib
Subproject Path: CordovaLib
(node:21281) [DEP0016] DeprecationWarning: ‘root’ is deprecated, use ‘global’
e[36m20181026T160801 [DEBUG] AndroidBuilder -e[39m [prepare] cordova restore plugins
e[36m20181026T160801 [DEBUG] AndroidBuilder -e[39m [prepare] adding plugin cocoon-plugin-ads-android-admob@*
e[36m20181026T160801 [DEBUG] AndroidBuilder -e[39m [prepare] adding plugin com.ludei.canvasplus.android@2.6.1
e[36m20181026T160801 [DEBUG] AndroidBuilder -e[39m [prepare] adding plugin com.ludei.canvasplus.ios@2.6.1
e[36m20181026T160801 [DEBUG] AndroidBuilder -e[39m [prepare] adding plugin com.ludei.defaultres.android@1.0.1
e[36m20181026T160801 [DEBUG] AndroidBuilder -e[39m [prepare] adding plugin com.ludei.installlocation.android@1.0.0
e[36m20181026T160801 [DEBUG] AndroidBuilder -e[39m [prepare] adding plugin com.ludei.splash.android@1.1.0
e[36m20181026T160801 [DEBUG] AndroidBuilder -e[39m [prepare] adding plugin cordova-plugin-whitelist@1
e[36m20181026T160801 [DEBUG] AndroidBuilder -e[39m [prepare] adding plugin https://github.com/CocoonIO/cocoon-plugin-android-architecture.git
Subproject Path: CordovaLib
cp: dest file already exists: /workspace/plugins/cocoon-plugin-android-architecture/LICENSE

cp: dest file already exists: /workspace/plugins/cocoon-plugin-android-architecture/LICENSE
cp: dest file already exists: /workspace/plugins/cocoon-plugin-android-architecture/README.md

skipping existing file: architecture.gradle
cp: dest file already exists: /workspace/plugins/cocoon-plugin-android-architecture/LICENSE
cp: dest file already exists: /workspace/plugins/cocoon-plugin-android-architecture/README.md
cp: dest file already exists: /workspace/plugins/cocoon-plugin-android-architecture/plugin.xml

e[36m20181026T160805 [DEBUG] AndroidBuilder -e[39m [build]
Warning: File /.android/repositories.cfg could not be loaded.
e[36m20181026T160806 [DEBUG] AndroidBuilder -e[39m [build] call cordova
cp: dest file already exists: /workspace/plugins/cocoon-plugin-android-architecture/LICENSE

cp: dest file already exists: /workspace/plugins/cocoon-plugin-android-architecture/LICENSE
cp: dest file already exists: /workspace/plugins/cocoon-plugin-android-architecture/README.md

skipping existing file: architecture.gradle
cp: dest file already exists: /workspace/plugins/cocoon-plugin-android-architecture/LICENSE
cp: dest file already exists: /workspace/plugins/cocoon-plugin-android-architecture/README.md
cp: dest file already exists: /workspace/plugins/cocoon-plugin-android-architecture/plugin.xml

ANDROID_HOME=/opt/cocoon_compiler/workspace/production/data/sdks/android-sdks-linux
JAVA_HOME=/usr/lib/jvm/default-java
Subproject Path: CordovaLib
The Task.leftShift(Closure) method has been deprecated and is scheduled to be removed in Gradle 5.0. Please use Task.doLast(Action) instead.
at build_1q53si63dx26h5xs4hswnq6nu.run(/workspace/platforms/android/build.gradle:139)
The JavaCompile.setDependencyCacheDir() method has been deprecated and is scheduled to be removed in Gradle 4.0.
Incremental java compilation is an incubating feature.
The TaskInputs.source(Object) method has been deprecated and is scheduled to be removed in Gradle 4.0. Please use TaskInputs.file(Object).skipWhenEmpty() instead.

FAILURE: Build failed with an exception.

  • What went wrong:
    A problem occurred configuring root project ‘android’.

Could not resolve all dependencies for configuration ‘:_armv7DebugApkCopy’.
Could not find com.google.android.gms:play-services-ads:15.0.1.
Searched in the following locations:
file:/opt/cocoon_compiler/workspace/production/data/sdks/android-sdks-linux/extras/google/m2repository/com/google/android/gms/play-services-ads/15.0.1/play-services-ads-15.0.1.pom
file:/opt/cocoon_compiler/workspace/production/data/sdks/android-sdks-linux/extras/google/m2repository/com/google/android/gms/play-services-ads/15.0.1/play-services-ads-15.0.1.jar
file:/workspace/platforms/android/sdk-manager/com/google/android/gms/play-services-ads/15.0.1/play-services-ads-15.0.1.jar
file:/opt/cocoon_compiler/workspace/production/data/sdks/android-sdks-linux/extras/android/m2repository/com/google/android/gms/play-services-ads/15.0.1/play-services-ads-15.0.1.pom
file:/opt/cocoon_compiler/workspace/production/data/sdks/android-sdks-linux/extras/android/m2repository/com/google/android/gms/play-services-ads/15.0.1/play-services-ads-15.0.1.jar
file:/workspace/platforms/android/sdk-manager/com/google/android/gms/play-services-ads/15.0.1/play-services-ads-15.0.1.jar
Required by:
project :

  • Try:
    Run with --stacktrace option to get the stack trace. Run with --info or --debug option to get more log output.

BUILD FAILED

Total time: 2.7 secs
e[91m20181026T160814 [ERROR] AndroidBuilder -e[39m { Error: /workspace/platforms/android/gradlew: Command failed with exit code 1 Error output:
FAILURE: Build failed with an exception.

  • What went wrong:
    A problem occurred configuring root project ‘android’.

Could not resolve all dependencies for configuration ‘:_armv7DebugApkCopy’.
Could not find com.google.android.gms:play-services-ads:15.0.1.
Searched in the following locations:
file:/opt/cocoon_compiler/workspace/production/data/sdks/android-sdks-linux/extras/google/m2repository/com/google/android/gms/play-services-ads/15.0.1/play-services-ads-15.0.1.pom
file:/opt/cocoon_compiler/workspace/production/data/sdks/android-sdks-linux/extras/google/m2repository/com/google/android/gms/play-services-ads/15.0.1/play-services-ads-15.0.1.jar
file:/workspace/platforms/android/sdk-manager/com/google/android/gms/play-services-ads/15.0.1/play-services-ads-15.0.1.jar
file:/opt/cocoon_compiler/workspace/production/data/sdks/android-sdks-linux/extras/android/m2repository/com/google/android/gms/play-services-ads/15.0.1/play-services-ads-15.0.1.pom
file:/opt/cocoon_compiler/workspace/production/data/sdks/android-sdks-linux/extras/android/m2repository/com/google/android/gms/play-services-ads/15.0.1/play-services-ads-15.0.1.jar
file:/workspace/platforms/android/sdk-manager/com/google/android/gms/play-services-ads/15.0.1/play-services-ads-15.0.1.jar
Required by:
project :

  • Try:
    Run with --stacktrace option to get the stack trace. Run with --info or --debug option to get more log output.
    at ChildProcess.whenDone (/workspace/platforms/android/cordova/node_modules/cordova-common/src/superspawn.js:169:23)
    at ChildProcess.emit (events.js:182:13)
    at maybeClose (internal/child_process.js:961:16)
    at Process.ChildProcess._handle.onexit (internal/child_process.js:248:5)
    stderr:
    ‘\nFAILURE: Build failed with an exception.\n\n* What went wrong:\nA problem occurred configuring root project ‘android’.\n> Could not resolve all dependencies for configuration ‘:_armv7DebugApkCopy’.\n > Could not find com.google.android.gms:play-services-ads:15.0.1.\n Searched in the following locations:\n file:/opt/cocoon_compiler/workspace/production/data/sdks/android-sdks-linux/extras/google/m2repository/com/google/android/gms/play-services-ads/15.0.1/play-services-ads-15.0.1.pom\n file:/opt/cocoon_compiler/workspace/production/data/sdks/android-sdks-linux/extras/google/m2repository/com/google/android/gms/play-services-ads/15.0.1/play-services-ads-15.0.1.jar\n file:/workspace/platforms/android/sdk-manager/com/google/android/gms/play-services-ads/15.0.1/play-services-ads-15.0.1.jar\n file:/opt/cocoon_compiler/workspace/production/data/sdks/android-sdks-linux/extras/android/m2repository/com/google/android/gms/play-services-ads/15.0.1/play-services-ads-15.0.1.pom\n file:/opt/cocoon_compiler/workspace/production/data/sdks/android-sdks-linux/extras/android/m2repository/com/google/android/gms/play-services-ads/15.0.1/play-services-ads-15.0.1.jar\n file:/workspace/platforms/android/sdk-manager/com/google/android/gms/play-services-ads/15.0.1/play-services-ads-15.0.1.jar\n Required by:\n project :\n\n* Try:\nRun with --stacktrace option to get the stack trace. Run with --info or --debug option to get more log output.\n’,
    stdout:
    ‘The Task.leftShift(Closure) method has been deprecated and is scheduled to be removed in Gradle 5.0. Please use Task.doLast(Action) instead.\n\tat build_1q53si63dx26h5xs4hswnq6nu.run(/workspace/platforms/android/build.gradle:139)\nThe JavaCompile.setDependencyCacheDir() method has been deprecated and is scheduled to be removed in Gradle 4.0.\nIncremental java compilation is an incubating feature.\nThe TaskInputs.source(Object) method has been deprecated and is scheduled to be removed in Gradle 4.0. Please use TaskInputs.file(Object).skipWhenEmpty() instead.\n\nBUILD FAILED\n\nTotal time: 2.7 secs\n’,
    code: 1 }

Nao consigo corrigir esse erro me ajude por favor


#2

hi what version of cocoon do you use? and which plugins have you inserted? and especially that framework? uses construct 2